{"text_format":"1","workbook":"xlsx","n_sheets":7,"sheets":["Formulario","Valores disponibles","TABLA","Códigos CNAE","Codigos_Municipio","Codigos_Provincia","Codigos_ComunidadesAutonomas"],"not_rendered":{"charts":0,"images":2,"macros":1,"external_links":3,"defined_names":92,"comments":1,"pivot_tables":0},"unopened":[],"bounds":{"document_bytes":16777216,"sheet_cells":100000,"rows_first":2000,"rows_last":500,"rows_between":2000,"halvings":0,"cell_chars":16384,"cell_head_chars":4096},"cells_cut":0,"cells_raw":0,"read":"whole","date_system":"1900"}

{"sheet":"Formulario","index":0,"n_rows":115,"n_cols":32,"rows_kept":115,"cut":false,"hidden":false,"merged":[[106,3,106,35],[104,3,104,35],[42,3,42,12],[48,3,48,16],[50,3,50,35],[58,3,58,35],[60,3,60,9],[80,3,80,35],[86,3,86,35],[88,3,88,35],[90,3,90,35],[60,10,60,35],[57,1,57,36],[61,1,61,36],[63,1,63,36],[72,2,74,13],[69,1,69,36],[72,14,74,18],[70,2,70,13],[70,14,70,18],[62,2,62,35],[71,1,71,36],[64,2,66,13],[68,2,68,13],[0,1,3,37],[8,3,8,35],[10,3,10,35],[12,3,12,35],[18,3,18,35],[22,3,22,35],[30,3,30,35],[34,3,34,35],[40,3,40,35],[33,1,33,36],[36,3,36,13],[36,14,36,19],[36,20,36,35],[38,3,38,13],[38,14,38,20],[38,21,38,35],[39,1,39,36],[9,1,9,36],[11,1,11,36],[37,1,37,36],[70,31,70,35],[70,19,70,30],[64,31,64,35],[65,31,65,35],[66,31,66,35],[67,1,67,36],[101,1,101,36],[81,1,81,36],[82,2,82,32],[68,19,68,35],[73,19,73,30],[74,19,74,30],[77,1,77,36],[79,1,79,36],[76,2,76,30],[78,2,78,30],[76,31,76,35],[78,31,78,35],[113,1,113,36],[56,23,56,35],[56,16,56,22],[56,3,56,14],[59,1,59,36],[64,19,64,30],[65,19,65,30],[66,19,66,30],[72,19,72,30],[112,2,112,35],[110,2,110,35],[111,2,111,35],[87,1,87,36],[89,1,89,36],[109,1,109,36],[102,31,102,32],[102,23,102,24],[102,25,102,30],[99,2,99,35],[102,33,102,35],[107,1,107,36],[108,3,108,35],[97,1,97,36],[105,1,105,36],[26,21,26,35],[27,1,27,36],[52,3,52,13],[52,14,52,19],[52,20,52,35],[53,1,53,36],[32,15,32,16],[32,17,32,18],[114,2,114,36],[83,1,83,36],[84,2,84,35],[45,1,45,36],[85,1,85,36],[92,3,92,13],[92,14,92,19],[92,20,92,35],[96,3,96,13],[96,14,96,19],[96,20,96,35],[82,33,82,35],[93,1,93,36],[94,3,94,35],[72,31,72,35],[73,31,73,35],[13,1,13,36],[16,14,16,19],[16,20,16,35],[15,1,15,36],[14,14,14,19],[14,20,14,35],[14,3,14,13],[16,3,16,13],[21,1,21,36],[20,14,20,35],[6,2,6,35],[4,1,4,36],[5,1,5,36],[100,1,100,36],[103,1,103,36],[17,1,17,36],[28,2,28,35],[31,1,31,36],[29,1,29,36],[75,1,75,36],[95,1,95,36],[98,1,98,36],[91,1,91,36],[7,1,7,36],[23,1,23,36],[24,3,24,13],[24,14,24,19],[24,20,24,35],[25,1,25,36],[26,3,26,13],[26,14,26,20],[19,1,19,36],[20,3,20,13],[41,1,41,36],[46,3,46,15],[46,16,46,35],[42,14,42,19],[42,20,42,35],[44,2,44,35],[32,3,32,13],[35,1,35,36],[102,2,102,9],[102,20,102,22],[43,1,43,36],[54,3,54,13],[54,14,54,20],[54,21,54,35],[32,20,32,35],[74,31,74,35],[55,1,55,36],[47,1,47,36],[48,17,48,24],[48,25,48,35],[49,1,49,36],[51,1,51,36],[102,12,102,18],[64,14,66,18],[68,14,68,18]]}
[]
[]
[]
[]
[null,"COMUNICACIÓN DE REALIZACIÓN DE UNA AUDITORÍA ENERGÉTICA"]
[]
[null,null,"PERSONA QUE PRESENTA LA COMUNICACIÓN"]
[]
[null,null,"Nombre"]
[]
[null,null,"Primer Apellido:"]
[]
[null,null,"Segundo Apellido:"]
[]
[null,null,"DNI:",null,null,null,null,null,null,null,null,null,null,null,"Cargo:"]
[]
[null,null,"Teléfono: ",null,null,null,null,null,null,null,null,null,null,null,"Correo electrónico:"]
[]
[null,null,"Nombre de la empresa"]
[]
[null,null,"NIF:"]
[]
[null,null,"Domicilio Social:"]
[]
[null,null,"C.P.:",null,null,null,null,null,null,null,null,null,null,null,"Localidad:"]
[]
[null,null,"Provincia: ",null,null,null,null,null,null,null,null,null,null,null,"Comunidad Autónoma:"]
[]
[null,null,"EMPRESA AUDITADA"]
[]
[null,null,"Razón Social:"]
[]
[null,null,"NIF:",null,null,null,null,null,null,null,null,null,null,null,null,"CNAE:",null,null,null,null,{"$f":"VLOOKUP(R33,'Códigos CNAE'!A1:B630,2)","v":{"$error":"#N/A"}}]
[]
[null,null,"Domicilio Social:"]
[]
[null,null,"C.P.:",null,null,null,null,null,null,null,null,null,null,null,"Localidad:"]
[]
[null,null,"Provincia: ",null,null,null,null,null,null,null,null,null,null,null,"Comunidad Autónoma:"]
[]
[null,null,"Tamaño de la empresa:"]
[]
[null,null,"Teléfono: ",null,null,null,null,null,null,null,null,null,null,null,"Correo electrónico:"]
[]
[null,null,"AUDITORÍA ENERGÉTICA REALIZADA"]
[]
[null,null,"Fecha:"]
[]
[null,null,"Tipo de auditoría:",null,null,null,null,null,null,null,null,null,null,null,null,null,null,"Fecha auditoría anterior:"]
[]
[null,null,"Domicilio Instalaciones:"]
[]
[null,null,"C.P.:",null,null,null,null,null,null,null,null,null,null,null,"Localidad:"]
[]
[null,null,"Provincia: ","NAVARRA",null,null,null,null,null,null,null,null,null,null,"Comunidad Autónoma:",null,null,null,null,null,null,"NAVARRA"]
[]
[null,null,"Actividad:",null,null,null,null,null,null,null,null,null,null,null,null,null,"Instalaciones auditadas:"]
[]
[null,null,"Indicar qué parte: "]
[]
[null,null,"Multiples ubicaciones: * "]
[]
[null,null,"Datos del resultado de la auditoria"]
[]
[null,null,"Ahorro energético estimado (kWh/año):",null,null,null,null,null,null,null,null,null,null,null,{"$f":"SUM(AF65:AJ67)","v":0},null,null,null,null,"Energía eléctrica (kWh/año):"]
[null,null,null,null,null,null,null,null,null,null,null,null,null,null,null,null,null,null,null,"Energía térmica (kWh/año):"]
[null,null,null,null,null,null,null,null,null,null,null,null,null,null,null,null,null,null,null,"Transporte (kWh/año):"]
[]
[null,null,"Emisiones CO2 evitadas (ton CO2):"]
[]
[null,null,"Inversión estimada para acometer las mejoras (€):",null,null,null,null,null,null,null,null,null,null,null,null,null,null,null,null,"Período de retorno de la inversión (años):"]
[]
[null,null,"Consumo energético (kWh/año):",null,null,null,null,null,null,null,null,null,null,null,{"$f":"SUM(AF73:AJ75)","v":0},null,null,null,null,"Energía eléctrica (kWh/año):"]
[null,null,null,null,null,null,null,null,null,null,null,null,null,null,null,null,null,null,null,"Energía térmica (kWh/año):"]
[null,null,null,null,null,null,null,null,null,null,null,null,null,null,null,null,null,null,null,"Transporte (kWh/año):"]
[]
[null,null,"Ahorros energéticos por mejoras implementadas derivadas de la última comunicación relativa a la realización de una auditoría energética (kWh/año) **:",null,null,null,null,null,null,null,null,null,null,null,null,null,null,null,null,null,null,null,null,null,null,null,null,null,null,null,null,0]
[]
[null,null,"Porcentaje que supone el consumo asociado a esta instalación respecto al consumo total de energía final de la empresa en el territorio nacional (%):"]
[]
{"$rows_left_out":36}
{"sheet":"Valores disponibles","index":1,"n_rows":32,"n_cols":12,"rows_kept":32,"cut":false,"hidden":true,"merged":[]}
["Tamaño empresa ","Tipo auditoria","Actividad","Instalaciones auditadas","Auditor","Titulación","Gestion certificado / Ubicaciones_multiples",null,"meses",null,"días","año"]
["Grande","Primera auditoría","Agricultura, ganadería, pesca","Todas","Interno","Universitaria","SI",null,"enero","01","01",2023]
["Mediana","Actualización","Minería","Parte","Externo","Formación profesional o certificado de profesionalidad","NO",null,"febrero","02","02",2024]
["Pequeña",null,"Industria",null,null,"Competencia profesional adquirida por experiencia laboral",null,null,"marzo","03","03",2025]
[null,null,"Energía   ",null,null,null,null,null,"abril","04","04",2026]
[null,null,"Construcción y obras públicas   ",null,null,null,null,null,"mayo","05","05",2027]
[null,null,"Transporte y logística",null,null,null,null,null,"junio","06","06",2028]
[null,null,"Comercio, servicios, hostelería   ",null,null,null,null,null,"julio","07","07",2029]
[null,null,"Otros",null,null,null,null,null,"agosto","08","08",2030]
[null,null,null,null,null,null,null,null,"septiembre","09","09",2031]
[null,null,null,null,null,null,null,null,"octubre","10","10"]
[null,null,null,null,null,null,null,null,"noviembre","11","11"]
[null,null,null,null,null,null,null,null,"diciembre","12","12"]
[null,null,null,null,null,null,null,null,null,null,"13"]
[null,null,null,null,null,null,null,null,null,null,"14"]
[null,null,null,null,null,null,null,null,null,null,"15"]
[null,null,null,null,null,null,null,null,null,null,"16"]
[null,null,null,null,null,null,null,null,null,null,"17"]
[null,null,null,null,null,null,null,null,null,null,"18"]
[null,null,null,null,null,null,null,null,null,null,"19"]
[null,null,null,null,null,null,null,null,null,null,"20"]
[null,null,null,null,null,null,null,null,null,null,"21"]
[null,null,null,null,null,null,null,null,null,null,"22"]
[null,null,null,null,null,null,null,null,null,null,"23"]
[null,null,null,null,null,null,null,null,null,null,"24"]
[null,null,null,null,null,null,null,null,null,null,"25"]
[null,null,null,null,null,null,null,null,null,null,"26"]
[null,null,null,null,null,null,null,null,null,null,"27"]
[null,null,null,null,null,null,null,null,null,null,"28"]
[null,null,null,null,null,null,null,null,null,null,"29"]
[null,null,null,null,null,null,null,null,null,null,"30"]
[null,null,null,null,null,null,null,null,null,null,"31"]

{"sheet":"TABLA","index":2,"n_rows":3,"n_cols":68,"rows_kept":3,"cut":false,"hidden":true,"merged":[[0,66,0,68],[0,0,0,14],[0,15,0,18],[0,21,0,32],[0,34,0,48],[0,49,0,55],[0,58,1,58],[0,59,0,60],[0,61,1,61],[0,62,0,65]]}
["Datos de la persona que realiza la comunicación",null,null,null,null,null,null,null,null,null,null,null,null,null,null,"Datos del Auditor",null,null,null,null,null,"Empresa auditada",null,null,null,null,null,null,null,null,null,null,null,null,"Datos del resultado de la auditoria",null,null,null,null,null,null,null,null,null,null,null,null,null,null,"Datos Gobierno de Navarra",null,null,null,null,null,null,"Inspección","Comentarios","Estado comunicación","RAAE",null,"NOTAS","AUDITORIA",null,null,null,"PLAN INSPECCION"]
["Nombre","Primer_Apellido","Segundo_Apellido","DNI","Nombre_Empresa","NIF","Direccion","Comunidad_Autonoma","Provincia","Municipio","Codigo_Postal","Telefono_Contacto","Correo_Electronico","Fecha_Presentacion","Lugar_Presentacion","Nombre_Auditor","Primer_Apellido_Auditor","Segundo_Apellido_Auditor","DNI_(opcional)","Titulacion Auditor","Tipo Auditor (Externo/Interno)","Expediente","Expediente raiz","Solicitar actualizacion","Comentarios actualizacion","Nombre_Empresa/Instalacion_Auditada","Fecha_Auditoria","Ubicaciones_multiples (SI/NO) (opcional)","Direccion_Instalacion","Comunidad_Autonoma","Provincia_Instalacion","Municipio_Instalacion","Codigo_Postal_Instalacion","CNAE","Ahorro_energetico_estimado (kWh/año)","Ahorro_energetico_estimado En. electrica (kWh/año)","Ahorro_energetico_estimado En. termica (kWh/año)","Ahorro_energetico_estimado Transporte (kWh/año)","Consumo_Energetico (kWh/año)","Consumo_Energetico En. electrica (kWh/año)","Consumo_Energetico En. termica (kWh/año)","Consumo_Energetico Transporte (kWh/año)","Emisiones_CO2 (tCO2 e/año)","Inversion_Estimada (euros)","%_sobre_Consumo_Energetico_Total (opcional)","Retorno_Inversion (años con dos decimales)","Ahorros_Energeticos_mejoras_auditoria_previa (kWh/año)","Desglose de mejoras","Tiene un sistema de gestión certificado (SI/NO) (opcional)","Tamaño empresa","Actividad","Tipo auditoría","Fecha auditoría anterior","Instalaciones auditadas","Parte auditada específica","Titulación auditor","Estado inspección","Comentarios",null,"Remisión al Ministerio","Fecha de registro",null,"SOLICITADA","PRESENTADA","FECHA PRESENTACION","NOTAS",2018,2019]
[{"$f":"Formulario!D9","v":0},{"$f":"Formulario!D11","v":0},{"$f":"Formulario!D13","v":0},{"$f":"Formulario!D15","v":0},{"$f":"Formulario!D19","v":0},{"$f":"Formulario!D21","v":0},{"$f":"Formulario!D23","v":0},{"$f":"Formulario!V27","v":0},{"$f":"Formulario!D27","v":0},{"$f":"Formulario!U25","v":0},{"$f":"Formulario!D25","v":0},{"$f":"Formulario!D17","v":0},{"$f":"Formulario!U17","v":0},{"$f":"CONCATENATE(Formulario!U103,\"/\",Formulario!Z103,\"/\",Formulario!AH103)","v":"//"},"RGE",{"$f":"Formulario!D87","v":0},{"$f":"Formulario!D89","v":0},{"$f":"Formulario!D91","v":0},{"$f":"Formulario!D93","v":0},{"$f":"Formulario!D95","v":0},{"$f":"Formulario!U93","v":0},null,null,null,null,{"$f":"Formulario!D31","v":0},{"$f":"Formulario!D47","v":"00:00:00"},{"$f":"Formulario!D61","v":0},{"$f":"IF(AB3=\"SI\",\"VARIAS DIRECCIONES\",Formulario!D51)","v":0},"NAVARRA","NAVARRA",{"$f":"IF(AB3=\"SI\",\"VARIOS MUNICIPIOS\",Formulario!U53)","v":0},{"$f":"Formulario!D53","v":0},{"$f":"Formulario!R33","v":0},{"$f":"Formulario!O65","v":0},{"$f":"Formulario!AF65","v":0},{"$f":"Formulario!AF66","v":0},{"$f":"Formulario!AF67","v":0},{"$f":"Formulario!O73","v":0},{"$f":"Formulario!AF73","v":0},{"$f":"Formulario!AF74","v":0},{"$f":"Formulario!AF75","v":0},{"$f":"Formulario!O69","v":0},{"$f":"Formulario!O71","v":0},{"$f":"Formulario!AF79","v":0},{"$f":"Formulario!AF71","v":0},{"$f":"Formulario!AF77","v":0},{"$f":"Formulario!D81","v":0},{"$f":"Formulario!AH83","v":0},"=Formulario!D41",{"$f":"Formulario!D57","v":0},{"$f":"Formulario!D49","v":0},{"$f":"Formulario!Z49","v":"00:00:00"},{"$f":"Formulario!X57","v":0},{"$f":"IF(Formulario!D59=\"\",\"\")","v":""},{"$f":"Formulario!D95","v":0},null,null,null,"ENVIAR"]

{"sheet":"Códigos CNAE","index":3,"n_rows":630,"n_cols":2,"rows_kept":630,"cut":false,"hidden":false,"merged":[]}
["Codigo","Titulo Actividad"]
["A0111","Cultivo de cereales (excepto arroz), leguminosas y semillas oleaginosas"]
["A0112","Cultivo de arroz"]
["A0113","Cultivo de hortalizas, raíces y tubérculos"]
["A0114","Cultivo de caña de azúcar"]
["A0115","Cultivo de tabaco"]
["A0116","Cultivo de plantas para fibras textiles"]
["A0119","Otros cultivos no perennes"]
["A0121","Cultivo de la vid"]
["A0122","Cultivo de frutos tropicales y subtropicales"]
["A0123","Cultivo de cítricos"]
["A0124","Cultivo de frutos con hueso y pepitas"]
["A0125","Cultivo de otros árboles y arbustos frutales y frutos secos"]
["A0126","Cultivo de frutos oleaginosos"]
["A0127","Cultivo de plantas para bebidas"]
["A0128","Cultivo de especias, plantas aromáticas, medicinales y farmacéuticas"]
["A0129","Otros cultivos perennes"]
["A0130","Propagación de plantas"]
["A0141","Explotación de ganado bovino para la producción de leche"]
["A0142","Explotación de otro ganado bovino y búfalos"]
["A0143","Explotación de caballos y otros equinos"]
["A0144","Explotación de camellos y otros camélidos"]
["A0145","Explotación de ganado ovino y caprino"]
["A0146","Explotación de ganado porcino"]
["A0147","Avicultura"]
["A0149","Otras explotaciones de ganado"]
["A0150","Producción agrícola combinada con la producción ganadera"]
["A0161","Actividades de apoyo a la agricultura"]
["A0162","Actividades de apoyo a la ganadería"]
["A0163","Actividades de preparación posterior a la cosecha"]
["A0164","Tratamiento de semillas para reproducción"]
["A0170","Caza, captura de animales y servicios relacionados con las mismas"]
["A0210","Silvicultura y otras actividades forestales"]
["A0220","Explotación de la madera"]
["A0230","Recolección de productos silvestres, excepto madera"]
["A0240","Servicios de apoyo a la silvicultura"]
["A0311","Pesca marina"]
["A0312","Pesca en agua dulce"]
["A0321","Acuicultura marina"]
["A0322","Acuicultura en agua dulce"]
["B0510","Extracción de antracita y hulla"]
["B0520","Extracción de lignito"]
["B0610","Extracción de crudo de petróleo"]
["B0620","Extracción de gas natural"]
["B0710","Extracción de minerales de hierro"]
["B0721","Extracción de minerales de uranio y torio"]
["B0729","Extracción de otros minerales metálicos no férreos"]
["B0811","Extracción de piedra ornamental y para la construcción, piedra caliza, yeso, creta y pizarra"]
["B0812","Extracción de gravas y arenas; extracción de arcilla y caolín"]
["B0891","Extracción de minerales para productos químicos y fertilizantes"]
["B0892","Extracción de turba"]
["B0893","Extracción de sal"]
["B0899","Otras industrias extractivas n.c.o.p."]
["B0910","Actividades de apoyo a la extracción de petróleo y gas natural"]
["B0990","Actividades de apoyo a otras industrias extractivas"]
["C1011","Procesado y conservación de carne"]
["C1012","Procesado y conservación de volatería"]
["C1013","Elaboración de productos cárnicos y de volatería"]
["C1021","Procesado de pescados, crustáceos y moluscos"]
["C1022","Fabricación de conservas de pescado"]
["C1031","Procesado y conservación de patatas"]
["C1032","Elaboración de zumos de frutas y hortalizas"]
["C1039","Otro procesado y conservación de frutas y hortalizas"]
["C1042","Fabricación de margarina y grasas comestibles similares"]
["C1043","Fabricación de aceite de oliva"]
["C1044","Fabricación de otros aceites y grasas"]
["C1052","Elaboración de helados"]
["C1053","Fabricación de quesos"]
["C1054","Preparación de leche y otros productos lácteos"]
["C1061","Fabricación de productos de molinería"]
["C1062","Fabricación de almidones y productos amiláceos"]
["C1071","Fabricación de pan y de productos frescos de panadería y pastelería"]
["C1072","Fabricación de galletas y productos de panadería y pastelería de larga duración"]
["C1073","Fabricación de pastas alimenticias, cuscús y productos similares"]
["C1081","Fabricación de azúcar"]
["C1082","Fabricación de cacao, chocolate y productos de confitería"]
["C1083","Elaboración de café, té e infusiones"]
["C1084","Elaboración de especias, salsas y condimentos"]
["C1085","Elaboración de platos y comidas preparados"]
["C1086","Elaboración de preparados alimenticios homogeneizados y alimentos dietéticos"]
{"$rows_left_out":551}
{"sheet":"Codigos_Municipio","index":4,"n_rows":8121,"n_cols":3,"rows_kept":8121,"cut":false,"hidden":false,"merged":[]}
["CodMunicipio","CodProvincia","Municipio"]
[0,0]
["0018","31","Abáigar"]
["0023","31","Abárzuza/Abartzuza"]
["0039","31","Abaurregaina/Abaurrea Alta"]
["0044","31","Abaurrepea/Abaurrea Baja"]
["0057","31","Aberin"]
["0060","31","Ablitas"]
["0076","31","Adiós"]
["0082","31","Aguilar de Codés"]
["0095","31","Aibar/Oibar"]
["0116","31","Allín/Allin"]
["0121","31","Allo"]
["0109","31","Altsasu/Alsasua"]
["0137","31","Améscoa Baja"]
["0142","31","Ancín/Antzin"]
["0155","31","Andosilla"]
["0168","31","Ansoáin/Antsoain"]
["0174","31","Anue"]
["0180","31","Añorbe"]
["0193","31","Aoiz/Agoitz"]
["0207","31","Araitz"]
["0253","31","Arakil"]
["0214","31","Aranarache/Aranaratxe"]
["0235","31","Aranguren"]
["0240","31","Arano"]
["0229","31","Arantza"]
["0266","31","Aras"]
["0272","31","Arbizu"]
["0288","31","Arce/Artzi"]
["0291","31","Arcos, Los"]
["0305","31","Arellano"]
["0312","31","Areso"]
["0327","31","Arguedas"]
["0333","31","Aria"]
["0348","31","Aribe"]
["0351","31","Armañanzas"]
["0364","31","Arróniz"]
["0370","31","Arruazu"]
["0386","31","Artajona"]
["0399","31","Artazu"]
["0403","31","Atez/Atetz"]
["0581","31","Auritz/Burguete"]
["0410","31","Ayegui/Aiegi"]
["0425","31","Azagra"]
["0431","31","Azuelo"]
["0446","31","Bakaiku"]
["9019","31","Barañain"]
["0459","31","Barásoain"]
["0462","31","Barbarin"]
["0478","31","Bargota"]
["0484","31","Barillas"]
["0497","31","Basaburua"]
["0500","31","Baztan"]
["1379","31","Beintza-Labaien"]
["0517","31","Beire"]
["0522","31","Belascoáin"]
["2508","31","Bera"]
["0538","31","Berbinzana"]
["9058","31","Beriáin"]
["9024","31","Berrioplano/Berriobeiti"]
["9030","31","Berriozar"]
["0543","31","Bertizarana"]
["0556","31","Betelu"]
["2536","31","Bidaurreta"]
["0569","31","Biurrun-Olcoz"]
["0575","31","Buñuel"]
["0594","31","Burgui/Burgi"]
["0608","31","Burlada/Burlata"]
["0615","31","Busto, El"]
["0620","31","Cabanillas"]
["0636","31","Cabredo"]
["0641","31","Cadreita"]
["0654","31","Caparroso"]
["0667","31","Cárcar"]
["0673","31","Carcastillo"]
["0689","31","Cascante"]
["0692","31","Cáseda"]
["0706","31","Castejón"]
["0713","31","Castillonuevo"]
{"$rows_left_out":8042}
{"sheet":"Codigos_Provincia","index":5,"n_rows":54,"n_cols":3,"rows_kept":54,"cut":false,"hidden":false,"merged":[]}
["CodProvincia","Provincia","CodComunidad"]
["0",null,0]
[1,"Araba/Álava",16]
[2,"Albacete",8]
[3,"Alicante",10]
[4,"Almería",1]
[5,"Ávila",7]
[6,"Badajoz",11]
[7,"Baleares",4]
[8,"Barcelona",9]
[9,"Burgos",7]
[10,"Cáceres",11]
[11,"Cádiz",1]
[12,"Castellón",10]
[13,"Ciudad Real",8]
[14,"Córdoba",1]
[15,"Coruña (La)",12]
[16,"Cuenca",8]
[17,"Gerona",9]
[18,"Granada",1]
[19,"Guadalajara",8]
[20,"Gipuzkoa",16]
[21,"Huelva",1]
[22,"Huesca",2]
[23,"Jaén",1]
[24,"León",7]
[25,"Lérida",9]
[26,"Rioja (La)",17]
[27,"Lugo",12]
[28,"Madrid",13]
[29,"Málaga",1]
[30,"Murcia",14]
[31,"Navarra",15]
[32,"Orense",12]
[33,"Asturias",3]
[34,"Palencia",7]
[35,"Palmas (Las)",5]
[36,"Pontevedra",12]
[37,"Salamanca",7]
[38,"Santa Cruz de Tenerife",5]
[39,"Cantabria",6]
[40,"Segovia",7]
[41,"Sevilla",1]
[42,"Soria",7]
[43,"Tarragona",9]
[44,"Teruel",2]
[45,"Toledo",8]
[46,"Valencia",10]
[47,"Valladolid",7]
[48,"Bizkaia",16]
[49,"Zamora",7]
[50,"Zaragoza",2]
[51,"Ceuta",18]
[52,"Melilla",19]

{"sheet":"Codigos_ComunidadesAutonomas","index":6,"n_rows":21,"n_cols":2,"rows_kept":21,"cut":false,"hidden":false,"merged":[]}
["CodComunidad","NomComunidad"]
[0]
[1,"Andalucia"]
[2,"Aragón"]
[3,"Asturias"]
[4,"Baleares"]
[5,"Canarias"]
[6,"Cantabria"]
[7,"Castilla y León"]
[8,"Castilla - La Mancha"]
[9,"Cataluña"]
[10,"Comunidad Valenciana"]
[11,"Extremadura"]
[12,"Galicia"]
[13,"Madrid"]
[14,"Murcia"]
[15,"Navarra"]
[16,"País Vasco"]
[17,"Rioja (La)"]
[18,"Ceuta"]
[19,"Melilla"]